bugkazehakase - Bugs: bug #10584, build error 1.5.0

 
 
Show feedback again

You are not allowed to post comments on this tracker with your current authentification level.

bug #10584: build error 1.5.0

Submitted by:  Paul Heldens <pheldens>
Submitted on:  Sat 22 Dec 2007 04:50:09 PM UTC  
 
Category: NoneSeverity: 3 - Normal
Priority: 5 - NormalStatus: None
Privacy: PublicAssigned to: None
Open/Closed: Open

Sat 22 Dec 2007 04:50:09 PM UTC, original submission:

g++ -DHAVE_CONFIG_H -I. -I../../.. -I/usr/local/include/osb/ -I/usr/local/include/osb/NRCore/ -I/usr/local/include -I/usr/local/include/gtk-2.0 -I/usr/local/lib/gtk-2.0/include -I/usr/local/include/glib-2.0 -I/usr/local/lib/glib-2.0/include -I/usr/local/include/freetype2 -I/usr/local/include/pango-1.0 -I/usr/local/include/cairo -I/usr/local/include/libpng12 -I/usr/local/include/atk-1.0 -I../../../src -I../../../src/bookmarks -I../../../src/dialogs -I../../../src/net -I../../../src/libegg/pixbufthumbnail -I../../../src/utils -DGTK_DISABLE_DEPRECATED=1 -DGDK_DISABLE_DEPRECATED=1 -DG_DISABLE_DEPRECATED=1 -DG_LOG_DOMAIN=\"Kazehakase-GtkWebCore\" -DGTK_WEBCORE_VERSION=\"0.5.2\" -fno-rtti -fshort-wchar -MT gtk_webcore_la-kz-gtk-webcore.lo -MD -MP -MF .deps/gtk_webcore_la-kz-gtk-webcore.Tpo -c kz-gtk-webcore.cpp -fPIC -DPIC -o .libs/gtk_webcore_la-kz-gtk-webcore.o
kz-gtk-webcore.cpp: In function 'void kz_gtk_webcore_class_init(KzGtkWebcoreClass*)':
kz-gtk-webcore.cpp:238: error: invalid conversion from 'Webi* (*)(Webi*, const gchar*)' to 'gboolean (*)(Webi*, Webi*)'
kz-gtk-webcore.cpp:240: error: invalid conversion from 'gboolean (*)(Webi*, const gchar*, WebiCookie*)' to 'gboolean (*)(Webi*, WebiCookie*)'
kz-gtk-webcore.cpp: In function 'void kz_gtk_webcore_req_auth_prompt(Webi*, WebiAuthArgs*)':
kz-gtk-webcore.cpp:788: error: 'struct WebiAuthArgs_' has no member named 'url'
kz-gtk-webcore.cpp: In function 'void kz_gtk_webcore_copy_selection(KzEmbed*)':
kz-gtk-webcore.cpp:1095: error: invalid conversion from 'const gchar*' to 'gchar*'
make[4]: *** [gtk_webcore_la-kz-gtk-webcore.lo] Error 1

Paul Heldens <pheldens>

 

No files currently attached

 

Depends on the following items: None found

Items that depend on this one: None found

 

Carbon-Copy List
  • -unavailable- added by pheldens (Submitted the item)
  •  

    Do you think this task is very important?
    If so, you can click here to add your encouragement to it.
    This task has 0 encouragements so far.

    Only logged-in users can vote.

     

    Please enter the title of George Orwell's famous dystopian book (it's a date):

     

     

    No Changes Have Been Made to This Item
    Show feedback again

    Back to the top


    Powered by Savane 3.1-cleanup