bugCal3D - 3d character animation library - Bugs: bug #11795, Error when compiling...

 
 
Show feedback again

bug #11795: Error when compiling cal3d_miniviewer (all versions)

Submitted by:  None
Submitted on:  Thu 05 Jun 2008 01:04:57 PM UTC  
 
Category: NoneSeverity: 3 - Normal
Priority: 5 - NormalStatus: None
Privacy: PublicAssigned to: None
Originator Email: -unavailable-Open/Closed: Open

Add a New Comment (Rich MarkupRich Markup):
   

You are not logged in

Please log in, so followups can be emailed to you.

 

Thu 05 Jun 2008 01:04:57 PM UTC, original submission:

Hi,

I'm trying to install cal3d_miniviewer and get the following error after typing 'make':

viewer.cpp: In constructor »Viewer::Viewer()«:
viewer.cpp:32: Fehler: keine passende Funktion für Aufruf von »CalCoreModel::CalCoreModel()«
/usr/local/include/cal3d/coremodel.h:28: Anmerkung: Kandidaten sind: CalCoreModel::CalCoreModel(const std::string&)
/usr/local/include/cal3d/coremodel.h:26: Anmerkung: CalCoreModel::CalCoreModel(const CalCoreModel&)
viewer.cpp:32: Fehler: keine passende Funktion für Aufruf von »CalModel::CalModel()«
/usr/local/include/cal3d/model.h:33: Anmerkung: Kandidaten sind: CalModel::CalModel(CalCoreModel*)
/usr/local/include/cal3d/model.h:31: Anmerkung: CalModel::CalModel(const CalModel&)
viewer.cpp: In member function »bool Viewer::onCreate(int, char**)«:
viewer.cpp:238: Fehler: »class CalModel« hat kein Element namens »create«
viewer.cpp: In member function »bool Viewer::onInit()«:
viewer.cpp:340: Fehler: »class CalRenderer« hat kein Element namens »attachMesh«
viewer.cpp: In member function »void Viewer::onKey(unsigned char, int, int)«:
viewer.cpp:407: Fehler: »class CalRenderer« hat kein Element namens »setLodLevel«
viewer.cpp: In member function »void Viewer::onShutdown()«:
viewer.cpp:541: Fehler: »class CalModel« hat kein Element namens »destroy«
viewer.cpp:544: Fehler: »class CalCoreModel« hat kein Element namens »destroy«
viewer.cpp: In member function »bool Viewer::parseModelConfiguration(const std::string&)«:
viewer.cpp:594: Fehler: »class CalCoreModel« hat kein Element namens »create«
make[2]: *** [viewer.o] Fehler 1
make[2]: Verlasse Verzeichnis '/home/thorsten/Desktop/Modellierung/Cal3D/cal3d_miniviewer-0.6/src'
make[1]: *** [all-recursive] Fehler 1
make[1]: Verlasse Verzeichnis '/home/thorsten/Desktop/Modellierung/Cal3D/cal3d_miniviewer-0.6'
make: *** [all-recursive-am] Fehler 2

Is there any way to fix it?

Greetings
Thorsten

Anonymous

 

(Note: upload size limit is set to 1024 kB, after insertion of the required escape characters.)

Attach File(s):
   
   
Comment:
   

No files currently attached

 

Depends on the following items: None found

Items that depend on this one: None found

 

Carbon-Copy List
  • -unavailable- added by None (Submitted the item)
  •  

    Do you think this task is very important?
    If so, you can click here to add your encouragement to it.
    This task has 0 encouragements so far.

    Only logged-in users can vote.

     

    Please enter the title of George Orwell's famous dystopian book (it's a date):

     

     

    No Changes Have Been Made to This Item
    Show feedback again

    Back to the top


    Powered by Savane 3.1-cleanup