bugFreeciv - Bugs: bug #20291, Cannot finish compiling latest...

 
 
Show feedback again

bug #20291: Cannot finish compiling latest freeciv code

Submitted by:  Roland Haeder <quix0r>
Submitted on:  Sun 11 Nov 2012 03:42:32 PM UTC  
 
Category: bootstrapSeverity: 3 - Normal
Priority: 5 - NormalStatus: Duplicate
Assigned to: Marko Lindqvist <cazfi>Open/Closed: Closed
Release: trunkOperating System: GNU/Linux
Planned Release: 

Add a New Comment (Rich MarkupRich Markup):
   

You are not logged in

Please log in, so followups can be emailed to you.

 

Mon 14 Jan 2013 08:12:08 AM UTC, comment #3:

See also bug #20413

Marko Lindqvist <cazfi>
Project AdministratorIn charge of this item.
Fri 16 Nov 2012 02:53:49 PM UTC, comment #2:

gcc (Debian 4.7.2-4) 4.7.2
GNU ld (GNU Binutils for Debian) 2.22

Roland Haeder <quix0r>
Thu 15 Nov 2012 11:35:55 PM UTC, comment #1:

What's the version of gcc you are getting this error with?

Marko Lindqvist <cazfi>
Project AdministratorIn charge of this item.
Sun 11 Nov 2012 03:42:32 PM UTC, original submission:

The compilation files here:

<pre>distcc[25552] ERROR: compile ../../../freeciv/client/cityrepdata.c on 192.168.2.3 failed
distcc[25552] (dcc_build_somewhere) Warning: remote compilation of '../../../freeciv/client/cityrepdata.c' failed, retrying locally
distcc[25552] Warning: failed to distribute ../../../freeciv/client/cityrepdata.c to 192.168.2.3, running locally instead
In file included from ../../../freeciv/client/cityrepdata.c:843:0:
../../../freeciv/client/cityrepdata.c: In function 'split_string':
../../../freeciv/utility/specvec.h:129:29: error: 'd.string_value' may be used uninitialized in this function [-Werror=maybe-uninitialized]
../../../freeciv/client/cityrepdata.c:956:20: note: 'd.string_value' was declared here
cc1: all warnings being treated as errors
distcc[25552] ERROR: compile ../../../freeciv/client/cityrepdata.c on localhost failed
make[3]: *** [cityrepdata.lo] Error 1
make[3]: *** Waiting for unfinished jobs....
make[2]: *** [all-recursive] Error 1
make[1]: *** [all-recursive] Error 1
make: *** [all] Error 2</pre>

Roland Haeder <quix0r>

 

(Note: upload size limit is set to 1024 kB, after insertion of the required escape characters.)

Attach File(s):
   
   
Comment:
   

No files currently attached

 

Depends on the following items: None found

Items that depend on this one: None found

 

Carbon-Copy List
  • -unavailable- added by jtn (Updated the item)
  • -unavailable- added by cazfi (Posted a comment)
  • -unavailable- added by quix0r (Submitted the item)
  •  

    Do you think this task is very important?
    If so, you can click here to add your encouragement to it.
    This task has 0 encouragements so far.

    Only logged-in users can vote.

     

    Please enter the title of George Orwell's famous dystopian book (it's a date):

     

     

    Follow 4 latest changes.

    Date Changed By Updated Field Previous Value => Replaced By
    Wed 16 Jan 2013 11:08:51 PM UTCjtnOpen/ClosedOpen=>Closed
    Mon 14 Jan 2013 08:24:36 AM UTCcazfiCategorygeneral=>bootstrap
      StatusNone=>Duplicate
      Assigned toNone=>cazfi
    Show feedback again

    Back to the top


    Powered by Savane 3.1-cleanup