bugBattle for Wesnoth - Bugs: bug #21748, mp_connect unit tests fail

 
 
Show feedback again

bug #21748: mp_connect unit tests fail

Submitted by:  Fabian Müller <fendrin>
Submitted on:  Mon 03 Mar 2014 07:21:27 AM UTC  
 
Category: BugSeverity: 3 - Normal
Priority: 5 - NormalItem Group: Unit Tests
Status: NonePrivacy: Public
Assigned to: Andrius Silinskas <thunderstruck>Open/Closed: Open
Release: 1.11.11+Operating System: All

Add a New Comment (Rich MarkupRich Markup):
   

You are not logged in

Please log in, so followups can be emailed to you.

 

Mon 03 Mar 2014 07:21:27 AM UTC, original submission:

src/tests/test_mp_connect.cpp(141): error in "flg_map_settings": check side_engine->flg().choosable_factions().size() == 1 failed [7 != 1]
src/tests/test_mp_connect.cpp(142): error in "flg_map_settings": check side_engine->flg().current_faction()["id"] == "Custom" failed [Random != Custom]
src/tests/test_mp_connect.cpp(149): error in "flg_map_settings": check side_engine->flg().choosable_factions().size() == 1 failed [8 != 1]
src/tests/test_mp_connect.cpp(157): error in "flg_map_settings": check side_engine->flg().choosable_factions().size() == 1 failed [7 != 1]
src/tests/test_mp_connect.cpp(164): error in "flg_map_settings": check side_engine->flg().choosable_factions().size() == 1 failed [7 != 1]
src/tests/test_mp_connect.cpp(165): error in "flg_map_settings": check side_engine->flg().current_faction()["id"] == "Rebels" failed [Random != Rebels]
src/tests/test_mp_connect.cpp(179): error in "flg_map_settings": check side_engine->flg().choosable_factions().size() == 1 failed [7 != 1]
src/tests/test_mp_connect.cpp(180): error in "flg_map_settings": check side_engine->flg().current_faction()["id"] == "Custom" failed [Random != Custom]
src/tests/test_mp_connect.cpp(187): error in "flg_map_settings": check side_engine->flg().choosable_factions().size() == 1 failed [8 != 1]
src/tests/test_mp_connect.cpp(225): error in "flg_map_settings": check side_engine->flg().choosable_leaders().size() > 1 failed
src/tests/test_mp_connect.cpp(226): error in "flg_map_settings": check side_engine->flg().current_leader() == "random" failed [null != random]
src/tests/test_mp_connect.cpp(271): error in "flg_map_settings": check side_engine->flg().choosable_genders().size() == 1 failed [3 != 1]
src/tests/test_mp_connect.cpp(272): error in "flg_map_settings": check side_engine->flg().current_gender() == "female" failed [random != female]
src/tests/test_mp_connect.cpp(287): error in "flg_map_settings": check side_engine->flg().choosable_genders().size() == 1 failed [3 != 1]
src/tests/test_mp_connect.cpp(328): error in "flg_map_settings": check side_engine->flg().current_gender() == "male" failed [female != male]
src/tests/test_mp_connect.cpp(353): error in "flg_no_map_settings": check side_engine->flg().current_faction()["id"] == "Custom" failed [Random != Custom]

Fabian Müller <fendrin>
Project Member

 

(Note: upload size limit is set to 1024 kB, after insertion of the required escape characters.)

Attach File(s):
   
   
Comment:
   

No files currently attached

 

Depends on the following items: None found

Items that depend on this one: None found

 

Carbon-Copy List
  • -unavailable- added by fendrin (Submitted the item)
  •  

    Do you think this task is very important?
    If so, you can click here to add your encouragement to it.
    This task has 0 encouragements so far.

    Only logged-in users can vote.

     

    Please enter the title of George Orwell's famous dystopian book (it's a date):

     

     

    No Changes Have Been Made to This Item
    Show feedback again

    Back to the top


    Powered by Savane 3.1-cleanup