bugCal3D - 3d character animation library - Bugs: bug #11472, problem building

 
 
Show feedback again

bug #11472: problem building

Submitted by:  None
Submitted on:  Fri 11 Apr 2008 03:53:11 AM UTC  
 
Category: NoneSeverity: 3 - Normal
Priority: 5 - NormalStatus: None
Privacy: PublicAssigned to: None
Originator Email: -unavailable-Open/Closed: Open

Add a New Comment (Rich MarkupRich Markup):
   

You are not logged in

Please log in, so followups can be emailed to you.

 

Sun 27 Apr 2008 10:01:49 PM UTC, comment #1:

Thanks for the Patch :) And to the first Post use the SVN Version it works with the patch here under Arch Linux i have tested it.

Anonymous
Fri 11 Apr 2008 03:53:11 AM UTC, original submission:

Here is my problem:

hardwaremodel.cpp: In member function 'int CalHardwareModel::addVertex(CalHardwareModel::CalHardwareMesh&, int, CalCoreSubmesh*, int)':
hardwaremodel.cpp:754: error: 'memcpy' was not declared in this scope
hardwaremodel.cpp:765: error: 'memset' was not declared in this scope
hardwaremodel.cpp:776: error: 'memset' was not declared in this scope
hardwaremodel.cpp:793: error: 'memset' was not declared in this scope
make[3]: *** [hardwaremodel.lo] Error 1
make[3]: Leaving directory `/home/brandon/aur/cal3d/src/cal3d-0.10.0/src/cal3d'
make[2]: *** [all-recursive] Error 1
make[2]: Leaving directory `/home/brandon/aur/cal3d/src/cal3d-0.10.0/src'
make[1]: *** [all-recursive] Error 1
make[1]: Leaving directory `/home/brandon/aur/cal3d/src/cal3d-0.10.0'
make: *** [all] Error 2
==> ERROR: Build Failed.
Aborting...

I have had this happen every time I try to build cal3d, and have yet to find a binary package for it. (Currently for archlinux) Can you offer any help to this problem?

Anonymous

 

(Note: upload size limit is set to 1024 kB, after insertion of the required escape characters.)

Attach File(s):
   
   
Comment:
   

Attached Files
file #4241:  gcc43.patch added by None (583B - application/octet-stream - This patch fixes the issue for svn-rev. 493 -- beckmann.maik (at) googlemail (dot) com)

 

Depends on the following items: None found

Items that depend on this one: None found

 

CC list is empty

 

Do you think this task is very important?
If so, you can click here to add your encouragement to it.
This task has 0 encouragements so far.

Only logged-in users can vote.

 

Please enter the title of George Orwell's famous dystopian book (it's a date):

 

 

Follows 1 latest change.

Date Changed By Updated Field Previous Value => Replaced By
Tue 22 Apr 2008 07:18:58 PM UTCNoneAttached File-=>Added gcc43.patch, #4241
Show feedback again

Back to the top


Powered by Savane 3.1-cleanup