helpAdun - Support: sr #2384, Can't compile on Ubuntu 8.04 with...

Show feedback again

sr #2384: Can't compile on Ubuntu 8.04 with startup 0.23.0

Submitted by:  Germán Arias <espectador>
Submitted on:  Thu Jul 16 03:42:27 2009  
Category: NonePriority: 5 - Normal
Severity: 4 - ImportantStatus: Works For Me
Privacy: PublicAssigned to: None
Open/Closed: OpenOperating System: GNU/Linux

Add a New Comment (Rich MarkupRich Markup):

You are not logged in

Please log in, so followups can be emailed to you.


Wed Jan 27 15:35:36 2010, comment #3:

For the moment it seems to compile with startup 0.20.0

Raul Alcantara <rulix>
Thu Jul 16 17:10:05 2009, comment #2:

I get the same error. I send you attached the make output

(file #6215)

Germán Arias <espectador>
Thu Jul 16 09:55:31 2009, comment #1:


It seems like the include paths for the compiler aren't set up properly.
Can you try the following

- In Adun-0.81 source directory run "make clean"
- Then run "make debug=no messages=yes"

and if it fails again attach the full output of the make command.

Michael Johnston <mjohnston>
Project Administrator
Thu Jul 16 03:42:27 2009, original submission:

Hello, I'm trying to compile Adun-0.81 on my Ubuntu 8.04 with gnustep-startup-0.23.0 and GSL-1.10. When I do

make debug=NO

I get the errors (sorry, in spanish)

En el fichero incluído de ULFrameworkFunctions.m:1:
../ULFramework/ULFrameworkFunctions.h:5:39: aviso: AdunKernel/AdunDataSource.h: No existe el fichero ó directorio
../ULFramework/ULFrameworkFunctions.h:6:48: aviso: AdunKernel/AdunContainerDataSource.h: No existe el fichero ó directorio
../ULFramework/ULFrameworkFunctions.h:7:43: aviso: AdunKernel/AdunSimulationData.h: No existe el fichero ó directorio
../ULFramework/ULFrameworkFunctions.h:8:33: aviso: MolTalk/MTStructure.h: No existe el fichero ó directorio
In file included from ULFrameworkFunctions.m:1:
../ULFramework/ULFrameworkFunctions.h:35: error: expected declaration specifiers or ‘...’ before ‘AdDataMatrix’
../ULFramework/ULFrameworkFunctions.h:96: error: expected ‘=’, ‘,’, ‘;’, ‘asm’ or ‘__attribute__’ before ‘*’ token
../ULFramework/ULFrameworkFunctions.h:108: error: expected ‘)’ before ‘AdDataSource’
../ULFramework/ULFrameworkFunctions.h:110: error: expected ‘)’ before ‘AdSimulationData’
../ULFramework/ULFrameworkFunctions.h:124: error: no se puede encontrar la declaración de interfaz para ‘AdDataSource’
make[4]: *** [obj/ULFrameworkFunctions.m.o] Error 1
make[3]: *** [internal-framework-run-compile-submake] Error 2
make[2]: *** [ULFramework.all.framework.variables] Error 2
make[1]: *** [internal-all] Error 2
make: *** [internal-all] Error 2

Germán Arias <espectador>


(Note: upload size limit is set to 1024 kB, after insertion of the required escape characters.)

Attach File(s):

Attached Files
file #6215:  salida.txt added by espectador (22kB - text/plain)


Depends on the following items: None found

Items that depend on this one: None found


Carbon-Copy List
  • -unavailable- added by rulix (Posted a comment)
  • -unavailable- added by mjohnston (Posted a comment)
  • -unavailable- added by espectador (Submitted the item)
  • -unavailable- added by espectador

    Do you think this task is very important?
    If so, you can click here to add your encouragement to it.
    This task has 0 encouragements so far.

    Only logged-in users can vote.


    Error: not logged in



    Follow 3 latest changes.

    Date Changed By Updated Field Previous Value => Replaced By
    Wed Jan 27 15:35:36 2010rulixStatusNone=>Works For Me
    Thu Jul 16 17:10:05 2009espectadorAttached File-=>Added salida.txt, #6215
    Thu Jul 16 03:42:27 2009espectadorCarbon-Copy-=>Added espectador
    Show feedback again

    Back to the top

    Powered by Savane 3.1-cleanup